{"text_format":"1","workbook":"xlsx","n_sheets":6,"sheets":["Ark1","Version","Brugerark","Dataark","Dataark2","Vejledning"],"not_rendered":{"charts":0,"images":1,"macros":1,"external_links":0,"defined_names":7,"comments":0,"pivot_tables":0},"unopened":[],"bounds":{"document_bytes":16777216,"sheet_cells":100000,"rows_first":2000,"rows_last":500,"rows_between":2000,"halvings":0,"cell_chars":16384,"cell_head_chars":4096},"cells_cut":0,"cells_raw":0,"read":"whole","date_system":"1900"}

{"sheet":"Ark1","index":0,"n_rows":228,"n_cols":62,"rows_kept":228,"cut":false,"hidden":false,"merged":[]}
[null,"Valgfrie eller obligatoriske roller med valgfrie og obligatoriske signaturer"]
[]
[null,"VV = Valgfrie roller med valgfri signatur"]
[null,"VO = Valgfrie roller med obligatorisk signatur"]
[null,"OO = Obligatorisk rolle med obligatorisk signatur"]
[null,"OV = Obligatorisk rolle med valgfri signatur"]
[]
["Dokumenttyper i fast ejendom","Fuldmagtshaver","Udtrædende fuldmagtshaver","Fuldmagtsgiver","Sælger/overdrager","Køber/erhverver","Kreditor","Udtrædende kreditor","Debitor","Udtrædende debitor","Tiltrædende adkomsthaver","Kautionist","Pantsætter","Meddebitor","Ægtefælle","Underpanthaver","Meddelelseshaver","Udtrædende meddelelseshaver","Myndighed","Bobestyrer","Ejer","Kurator","Medhjælper","Påtaleberettiget","Udtrædende påtaleberettiget","Landinspektør","Brugspanthaver","Anmoder","Bortforpagter","Forpagter","Udlejer","Lejer","Efterlevende ægtefælle","Anden arving","Boet efter afdøde","Værge","Disponent"]
["1. EndeligtSkøde "," ",null," ","oox","oox",null,null,null,null,null,null,null,null,"vo",null,null,null,"vo","vo","vo","vo",null,"vo",null,"vo",null,"vv",null,null,null,null," ",null,"vo","vo"]
["2. EndeligtSkødeMageskifte"," "," "," ","oo","oo",null,null,null,null,null,null,null,null,"vo",null,null,null,"vo","vo","vo","vo",null,null,null,null,null,"vv",null,null,null,null," "," "," ","vo"]
["3. BetingetSkøde","vvx",null,"vox","oox","oox",null,null,null,null,null,null,null,null,"vo",null,null,null,"vo","vo","vo","vo",null,"vo",null,"vo",null,"vv",null,null,null,null," ",null,"vo","vo"]
["5. Bodeling",null,null,null,"oo","oo",null,null,null,null,null,null,null,null,null,null,null,null,"vo","vo","vo","vo",null,"vo",null,null,null,"vv",null,null,null,null,null,null,"vo","vo"]
["6. AndenAdkomst"," ",null," ","ov","ov",null,null,null,null,null,null,null,null,"vo",null,null,null,"vo","vo","vo","vo",null,"vo",null,null,null,"oo",null,null,null,null," ","vo","vo","vo"]
["7. PantebrevFastEjendom","vv"," ","vo",null,null,"ov",null,"oo",null,"vo","vo","vo","vo","vo",null,"vv",null,"vo","vo"," ","vo",null,"vo",null,null,null,"vv",null,null,null,null," ",null,"vo","vo"]
["11. EjerpantebrevFastEjendom",null," ","vo",null,null,"ov",null,"oo",null,"vo","vo","vo","vo","vo","vv","vv",null,"vo","vo",null,"vo",null,"vo",null,null,null,"vv",null,null,null,null,null,null,"vo","vo"]
["19. UnderpantFastEjendom",null,null,null,null,null,"oo",null,"vv",null,null," ",null,null," ","ov"," ",null,"vv","vo",null,"vo",null,null,null,null,null,"vv",null,null,null,null,null,null,"vo","vo"]
["23. Realkreditpantebrev ",null," ",null,null,null,"ov",null,"oo",null,"vo","vo","vo","vo","vo",null,null,null,"vo","vo",null,"vo",null,"vo",null,null,null,"vv",null,null,null,null,null,null,"vo","vo"]
["24. Indekspantebrev",null," ",null,null,null,"ov",null,"oo",null,"vo","vo","vo","vo","vo",null,"vv",null,"vo","vo",null,"vo",null,"vo",null,null,null,"vv",null,null,null,null,null,null,"vo","vo"]
["25. SkadesløsbrevFastEjendom",null,null,null,null,null,"ov",null,"oo",null,"vo","vo","vo","vo","vo",null,"vv",null,"vo","vo",null,"vo",null,"vo",null,null,null,"vv",null,null,null,null,null,null,"vo","vo"]
["32. UdlægFastEjendom",null,null,null,null,null,"ovx",null,"ovx",null,"vox"," ","vox",null,null,null,null,null,"oo","vo",null,"vo",null,null,null,null,null,"vv",null,null,null,null,null,null,null,"vo"]
{"$rows_left_out":209}
{"sheet":"Version","index":1,"n_rows":153,"n_cols":2,"rows_kept":153,"cut":false,"hidden":false,"merged":[]}
["Version","Beskrivelse"]
["04.02.2010","Baseline Bilbog"]
["16.03.2010","Fuldmagt bil 218/220 tilføjet med samme roller som fuldmagter i tingbogen - fuldmagtshaver ov og fuldmagtsgiver oo"]
["24.03.2010","ekstype 164 (ejer er sat til vv)"]
["24.03.2010","Udlæg - rollen pantsætter er sat til vv"]
["24.03.2010","ekstype 1,2,3,5,117,104,105,106,107,108,207 har fået tilføjet vv ved rollen anmoder"]
["16.04.2010","Bilbog slettet ekstype 200, Andelsbolig bogen slettet 202, personbogen slettet 201 - ændret bogstavskombinationen udfor ekstype 123 bilbog, 124 andelsboligbog. Myndighedsrollen er sat til OV og disponentrollen til OV og anmoderrollen til OO"]
["16.04.2010","Tilføjet til bilbog ekstype 215, 217, 218, 220 til andelsboligbog ekstype 216, 221, 222, 224 og til personbogen ekstype 225, 226, 228 samt 231 og indsat bogstavskombination"]
["27.04.2010","Pantebrev 7 og Ejerpantebrev 11, 212 i fast ejendom, 8 og 12 i bilbogen, 10 og 14 i Andelsboligbogen, 9 og 13 i personbogen  har fået tilføjet rolle fuldmagtshaver med VV,og fuldmagtsgiver med VO, meddebitor tilføjet med VO for 7,11, 23, 24, 25, 211, 212 i fastejendom"]
["27.04.2010","Tilføjet eksptype 232,233,234,235 og sat relevante roller til vv"]
["28.04.2010","Ekstyper 123 bilbog og 124 andelsboligbogen, har fået ny markering ud for debitor til vv istet for ov"]
["19.05.2010","Ekspeditionstype 167 og 171 er blevet opdateret, har fået fjernet OO anmoder og i stedet fået OO disponent"]
["21.05.2010","Fuldmagt andelsbolig- og personbogen har fået samme roller som tilsvarende anmeldelser i ting- og bilbogen"]
["25.05.2010","Der var en rettelse fra 04.05.2010 som ikke var med i dette register. Vilkårsændring bil fået debitor til vo"]
["31.05.2010","Rettelse af 28.04.2010 tilbageføres så debitor nu får kombination 0V på ekstype 123 og 124. Rollen påtaleberettiget fjernes fra ekstyper i bilbogen og andelsboligbogen. Rollen værge tilføjes ekstype Ny fuldmagt / tilbagekaldelse fuldmagt med VO for andelsboligbogen og personbogen. FastEjendom - rollen påtaleberettiget ændres til 00 for ekstype 41, 46, 47, 48."]
["15.06.2010","Ekstype 39 Ejendomsforbehold - fuldmagtshaver fået vv og fuldmagtsgiver vo, ekstype 61, 62, 63 Kreditorskifte i de små bøger - kreditor har fået vv, ekstype 93, 94, 95 nedlysning i de små bøger - kautionist har fået vo"]
["25.06.2010","Anmoderrollen sat til oo på ekstyperne Digitaliserpantebrev i alle bøger"]
["09.08.2010","Ekstype 41 Nye vedtægter (har fået myndighedsrollen som vo)"]
["10.08.2010","Rettelse angivet 15.7 ses ikke i dette register, hvorfor der må være sket en fejl med versionerne. Rettelsen af 15/7 genindføres Påtaleberettiget er angivet for alle servitutter p.t. som vv, da der er fejl, når påtaleberettiget er et matr.nr. "]
["07.09.2010","Tilrettet ekstype 105 således at anmoder er gjort obligatorisk, idet der ingen obligatorisk rolle er angivet, da påtaleberettiget p.t. ikke kan angives om 00 - fordi påtaleberettiget tilbage i akten kan være et matr.nr, og derfor ikke kan angives korrekt"]
{"$rows_left_out":134}
{"sheet":"Brugerark","index":2,"n_rows":39,"n_cols":5,"rows_kept":39,"cut":false,"hidden":false,"merged":[]}
[null,"Roller + signatur"]
[]
[]
[]
[]
[]
[]
["Område:","Fast ejendom"]
["Dokumenttype:","1. EndeligtSkøde "]
[]
["Fuldmagtshaver",{"$f":"IF(OR((VLOOKUP($B$9,Dataark2!$A$2:$AW$249,2)=\"\"),(VLOOKUP($B$9,Dataark2!$A$2:$AW$249,2)=\" \")),\"\",VLOOKUP(VLOOKUP($B$9,Dataark2!$A$2:$AW$249,2),Dataark!$F$1:$G$4,2))","v":""},null,"Bobestyrer",{"$f":"IF(OR((VLOOKUP($B$9,Dataark2!$A$2:$AW$249,20)=\"\"),(VLOOKUP($B$9,Dataark2!$A$2:$AW$249,20)=\" \")),\"\",VLOOKUP(VLOOKUP($B$9,Dataark2!$A$2:$AW$249,20),Dataark!$F$1:$G$4,2))","v":"Hvis rolle optræder, er signatur obligatorisk"}]
["Udtrædende fuldmagtshaver",{"$f":"IF(OR((VLOOKUP($B$9,Dataark2!$A$2:$AW$249,3)=\"\"),(VLOOKUP($B$9,Dataark2!$A$2:$AW$249,3)=\" \")),\"\",VLOOKUP(VLOOKUP($B$9,Dataark2!$A$2:$AW$249,3),Dataark!$F$1:$G$4,2))","v":""},null,"Ejer",{"$f":"IF(OR((VLOOKUP($B$9,Dataark2!$A$2:$AW$249,21)=\"\"),(VLOOKUP($B$9,Dataark2!$A$2:$AW$249,21)=\" \")),\"\",VLOOKUP(VLOOKUP($B$9,Dataark2!$A$2:$AW$249,21),Dataark!$F$1:$G$4,2))","v":"Hvis rolle optræder, er signatur obligatorisk"}]
["Fuldmagtsgiver",{"$f":"IF(OR((VLOOKUP($B$9,Dataark2!$A$2:$AW$249,4)=\"\"),(VLOOKUP($B$9,Dataark2!$A$2:$AW$249,4)=\" \")),\"\",VLOOKUP(VLOOKUP($B$9,Dataark2!$A$2:$AW$249,4),Dataark!$F$1:$G$4,2))","v":""},null,"Kurator",{"$f":"IF(OR((VLOOKUP($B$9,Dataark2!$A$2:$AW$249,22)=\"\"),(VLOOKUP($B$9,Dataark2!$A$2:$AW$249,22)=\" \")),\"\",VLOOKUP(VLOOKUP($B$9,Dataark2!$A$2:$AW$249,22),Dataark!$F$1:$G$4,2))","v":"Hvis rolle optræder, er signatur obligatorisk"}]
["Sælger/overdrager",{"$f":"IF(OR((VLOOKUP($B$9,Dataark2!$A$2:$AW$249,5)=\"\"),(VLOOKUP($B$9,Dataark2!$A$2:$AW$249,5)=\" \")),\"\",VLOOKUP(VLOOKUP($B$9,Dataark2!$A$2:$AW$249,5),Dataark!$F$1:$G$4,2))","v":"Obligatorisk rolle med obligatorisk signatur"},null,"Medhjælper",{"$f":"IF(OR((VLOOKUP($B$9,Dataark2!$A$2:$AW$249,23)=\"\"),(VLOOKUP($B$9,Dataark2!$A$2:$AW$249,23)=\" \")),\"\",VLOOKUP(VLOOKUP($B$9,Dataark2!$A$2:$AW$249,23),Dataark!$F$1:$G$4,2))","v":""}]
["Køber/erhverver",{"$f":"IF(OR((VLOOKUP($B$9,Dataark2!$A$2:$AW$249,6)=\"\"),(VLOOKUP($B$9,Dataark2!$A$2:$AW$249,6)=\" \")),\"\",VLOOKUP(VLOOKUP($B$9,Dataark2!$A$2:$AW$249,6),Dataark!$F$1:$G$4,2))","v":"Obligatorisk rolle med obligatorisk signatur"},null,"Påtaleberettiget",{"$f":"IF(OR((VLOOKUP($B$9,Dataark2!$A$2:$AW$249,24)=\"\"),(VLOOKUP($B$9,Dataark2!$A$2:$AW$249,24)=\" \")),\"\",VLOOKUP(VLOOKUP($B$9,Dataark2!$A$2:$AW$249,24),Dataark!$F$1:$G$4,2))","v":"Hvis rolle optræder, er signatur obligatorisk"}]
["Kreditor",{"$f":"IF(OR((VLOOKUP($B$9,Dataark2!$A$2:$AW$249,7)=\"\"),(VLOOKUP($B$9,Dataark2!$A$2:$AW$249,7)=\" \")),\"\",VLOOKUP(VLOOKUP($B$9,Dataark2!$A$2:$AW$249,7),Dataark!$F$1:$G$4,2))","v":""},null,"Udtrædende påtaleberettiget",{"$f":"IF(OR((VLOOKUP($B$9,Dataark2!$A$2:$AW$249,25)=\"\"),(VLOOKUP($B$9,Dataark2!$A$2:$AW$249,25)=\" \")),\"\",VLOOKUP(VLOOKUP($B$9,Dataark2!$A$2:$AW$249,25),Dataark!$F$1:$G$4,2))","v":""}]
["Udtrædende kreditor",{"$f":"IF(OR((VLOOKUP($B$9,Dataark2!$A$2:$AW$249,8)=\"\"),(VLOOKUP($B$9,Dataark2!$A$2:$AW$249,8)=\" \")),\"\",VLOOKUP(VLOOKUP($B$9,Dataark2!$A$2:$AW$249,8),Dataark!$F$1:$G$4,2))","v":""},null,"Landinspektør",{"$f":"IF(OR((VLOOKUP($B$9,Dataark2!$A$2:$AW$249,26)=\"\"),(VLOOKUP($B$9,Dataark2!$A$2:$AW$249,26)=\" \")),\"\",VLOOKUP(VLOOKUP($B$9,Dataark2!$A$2:$AW$249,26),Dataark!$F$1:$G$4,2))","v":"Hvis rolle optræder, er signatur obligatorisk"}]
["Debitor",{"$f":"IF(OR((VLOOKUP($B$9,Dataark2!$A$2:$AW$249,9)=\"\"),(VLOOKUP($B$9,Dataark2!$A$2:$AW$249,9)=\" \")),\"\",VLOOKUP(VLOOKUP($B$9,Dataark2!$A$2:$AW$249,9),Dataark!$F$1:$G$4,2))","v":""},null,"Brugspanthaver",{"$f":"IF(OR((VLOOKUP($B$9,Dataark2!$A$2:$AW$249,27)=\"\"),(VLOOKUP($B$9,Dataark2!$A$2:$AW$249,27)=\" \")),\"\",VLOOKUP(VLOOKUP($B$9,Dataark2!$A$2:$AW$249,27),Dataark!$F$1:$G$4,2))","v":""}]
["Udtrædende debitor",{"$f":"IF(OR((VLOOKUP($B$9,Dataark2!$A$2:$AW$249,10)=\"\"),(VLOOKUP($B$9,Dataark2!$A$2:$AW$249,10)=\" \")),\"\",VLOOKUP(VLOOKUP($B$9,Dataark2!$A$2:$AW$249,10),Dataark!$F$1:$G$4,2))","v":""},null,"Anmoder",{"$f":"IF(OR((VLOOKUP($B$9,Dataark2!$A$2:$AW$249,28)=\"\"),(VLOOKUP($B$9,Dataark2!$A$2:$AW$249,28)=\" \")),\"\",VLOOKUP(VLOOKUP($B$9,Dataark2!$A$2:$AW$249,28),Dataark!$F$1:$G$4,2))","v":"Hvis rolle optræder, er signatur valgfri"}]
["Tiltrædende adkomsthaver",{"$f":"IF(OR((VLOOKUP($B$9,Dataark2!$A$2:$AW$249,11)=\"\"),(VLOOKUP($B$9,Dataark2!$A$2:$AW$249,11)=\" \")),\"\",VLOOKUP(VLOOKUP($B$9,Dataark2!$A$2:$AW$249,11),Dataark!$F$1:$G$4,2))","v":""},null,"Bortforpagter",{"$f":"IF(OR((VLOOKUP($B$9,Dataark2!$A$2:$AW$249,29)=\"\"),(VLOOKUP($B$9,Dataark2!$A$2:$AW$249,29)=\" \")),\"\",VLOOKUP(VLOOKUP($B$9,Dataark2!$A$2:$AW$249,29),Dataark!$F$1:$G$4,2))","v":""}]
{"$rows_left_out":20}
{"sheet":"Dataark","index":3,"n_rows":108,"n_cols":7,"rows_kept":108,"cut":false,"hidden":false,"merged":[]}
["Fast ejendom","Bilbog","Andelsboligbog","Personbog",null,"OO","Obligatorisk rolle med obligatorisk signatur"]
["1. EndeligtSkøde ","8. PantebrevBil","10. PantebrevAndel","9. PantebrevLøsøre",null,"OV","Obligatorisk rolle med valgfri signatur"]
["2. EndeligtSkødeMageskifte","12. EjerpantebrevBil","14. EjerpantebrevAndel","13. EjerpantebrevLøsøre",null,"VO","Hvis rolle optræder, er signatur obligatorisk"]
["3. BetingetSkøde","20. UnderpantBil","22. UnderpantAndel","21. UnderpantPersonbogen",null,"VV","Hvis rolle optræder, er signatur valgfri"]
["5. Bodeling","26. SkadesløsbrevBil","28. SkadesløsbrevAndel","27. SkadesløsbrevLøsøre"]
["6. AndenAdkomst","33. UdlægBil","34. UdlægAndel","29. SkadesløsbrevVirksomhedspant"]
["7. PantebrevFastEjendom","36. ArrestBil","37. ArrestAndel","30. SkadesløsbrevFordringspant"]
["11. EjerpantebrevFastEjendom","39. EjendomsforbeholdBil","59. RespektAndel","31. Høstpantebrev"]
["19. UnderpantFastEjendom","57. RespektBil","63. KreditorskifteAndel","45. PantsætningsforbudPersonbogen"]
["23. Realkreditpantebrev ","61. KreditorskifteBil","67. DebitorskifteAndel","58. RespektPersonbogen"]
["24. Indekspantebrev","65. DebitorskifteBil","71. NyMeddelelseshaverAndel","62. KreditorskifteLøsøre"]
["25. SkadesløsbrevFastEjendom","69. NyMeddelelseshaverBil","75. NyFuldmagtshaverAndel","66. DebitorskifteLøsøre"]
["32. UdlægFastEjendom","73. NyFuldmagtshaverBil ","79. VilkårsændringAndel","70. NyMeddelelseshaverLøsøre"]
["35. ArrestFastEjendom","77. VilkårsændringBil","83. PåtegningHæftelseAndel","74. NyFuldmagtshaverLøsøre"]
["38. AndenHæftelseFastEjendom","81. PåtegningHæftelseBil","87. ForhøjelseAndel","78. VilkårsændringLøsøre"]
["40. Samejeoverenskomst ","85. ForhøjelseBil","91. UdvidelseHæftelseAndel","82. PåtegningHæftelsePersonbogen"]
["41. Vedtægter","89. UdvidelseHæftelseBil","95. NedlysningAndel","86. ForhøjelsePersonbogen"]
["46. SalgsOgPantsætningsforbud ","93. NedlysningBil","99. RelaksationAndel","90. UdvidelseHæftelseLøsøre"]
["47. Lejekontrakt","97. RelaksationBil","103. AflysningHæftelseAndel","94. NedlysningPersonbogen"]
["48. Forpagtningskontrakt","101. AflysningHæftelseBil","124. MeddelelseAndel","98. RelaksationLøsøre"]
{"$rows_left_out":89}
{"sheet":"Dataark2","index":4,"n_rows":215,"n_cols":62,"rows_kept":215,"cut":false,"hidden":false,"merged":[]}
["Dokumenttyper i fast ejendom","Fuldmagtshaver","Udtrædende fuldmagtshaver","Fuldmagtsgiver","Sælger/overdrager","Køber/erhverver","Kreditor","Udtrædende kreditor","Debitor","Udtrædende debitor","Tiltrædende adkomsthaver","Kautionist","Pantsætter","Meddebitor","Ægtefælle","Underpanthaver","Meddelelseshaver","Udtrædende meddelelseshaver","Myndighed","Bobestyrer","Ejer","Kurator","Medhjælper","Påtaleberettiget","Udtrædende påtaleberettiget","Landinspektør","Brugspanthaver","Anmoder","Bortforpagter","Forpagter","Udlejer","Lejer","Efterlevende ægtefælle","Anden arving","Boet efter afdøde","Værge","Disponent"]
["1. EndeligtSkøde "," ",null," ","oox","oox",null,null,null,null,null,null,null,null,"vo",null,null,null,"vo","vo","vo","vo",null,"vo",null,"vo",null,"vv",null,null,null,null," ",null,"vo","vo"]
["10. PantebrevAndel","vv"," ","vo",null,null,"ov",null,"oo",null," ","vo","vo","vo","vo",null,"vv",null,"vo","vo"," ","vo",null,null,null,null,null,"vo",null,null,null,null," ",null,"vo","vo"]
["100. AflysningHæftelseFastEjendom",null,null,null,null,null,"oo",null,"vv",null,null,"vo",null,null,null,"vo",null,null,"vv","vo"," ","vo",null,null,null,null,null,"vv",null,null,null,null,null,null,"vo","vo"]
["101. AflysningHæftelseBil",null,null,null,null,null,"oo",null,"vv",null,null,null,null,null,null,"vo",null,null,"vv","vo"," ","vo",null,null,null,null,null,"vv",null,null,null,null,null,null,"vo","vo"]
["102. AflysningHæftelsePersonbogen",null,null,null,null,null,"oo",null,"vv",null,null,null,null,null,null,"vo",null,null,"vo","vo"," ","vo",null,null,null,null,null,"vv",null,null,null,null,null,null,"vo","vo","vo"]
["103. AflysningHæftelseAndel",null,null,null,null,null,"oo",null,"vv",null,null,null,null,null,null,"vo",null,null,"vv","vo"," ","vo",null,null,null,null,null,"vv",null,null,null,null,null,null,"vo","vo"]
["104. RespektServitut ",null,null,null,null,null,null,null,null,null,null,null,null,null,null,null,null,null,"vo","vo","vv","vo",null,"oo",null,null,null,"vv",null,null,null,null,null,null,"vo","vo"]
["105. NyPåtaleberettiget ",null,null,null,null,null,null,null,null,null,null,null,null,null,null,null,null,null,"vo","vo","vo","vo",null,"vv","vo",null,null,"oo",null,null,null,null,null,null,"vo","vo"]
["106. PåtegningServitut",null,null,null,null,null,null,null,null,null,null,null,null,null,null,null,null,null,"vo","vo","vv","vo",null,"vo","vo","vo",null,"oo","vv","vv","vv","vv",null,null,"vo","vo"]
["107. RelaksationServitut ",null,null,null,null,null,null,null,null,null,null,null,null,null,null,null,null,null,"vo","vo","vv","vo",null,"oo",null,null,null,"vv","vv","vv","vv","vv",null,null,"vo","vo"]
["108. AflysningServitut ",null,null,null,null,null,null,null,null,null,null,null,null,null,null,null,null,null,"vo","vo","vv","vo",null,"oo",null,null,null,"vv","vv","vv","vv","vv",null,null,"vo","vo"]
["109. VielsesattestRådighedsindskrænkende ",null,null,null,null,null,null,null,null,null,null,null,null,null,"ov",null,null,null,"vv","vo"," ","vo",null,null,null,null,null,"oo",null,null,null,null,null,null,null,"vo"]
["11. EjerpantebrevFastEjendom",null," ","vo",null,null,"ov",null,"oo",null,"vo","vo","vo","vo","vo","vv","vv",null,"vo","vo",null,"vo",null,"vo",null,null,null,"vv",null,null,null,null,null,null,"vo","vo"]
["110. Tinglysningslovens§20",null,null,null,null,null,"vv",null,"vv",null,null,null,null,null,null,null,null,null,"vv","vo",null,"vo",null,"vv",null,null,null,"oo",null,null,null,null,null,null,null,"vo","vv"]
["112. Ekspropriation",null,null,null,null,null,null,null,null,null,null,null,null,null,null,null,null,null,"oo","vo",null,"vo",null,null,null,null,null,"vv",null,null,null,null,null,null,null,"vo"]
["113. Jordfordeling Foreløbig",null,null,null,null,null,null,null,null,null,null,null,null,null,null,null,null,null,"oo","vo",null,"vo",null,null,null,null,null,"vv",null,null,null,null,null,null,null,"vo"]
["114. Jordfordeling Endelig ",null,null,null,null,null,null,null,null,null,null,null,null,null,null,null,null,null,"oo","vo",null,"vo",null,null,null,null,null,"vv",null,null,null,null,null,null,null,"vo"]
["115. ÆgtepagtAdkomst",null,null,null,"oo","oo",null,null,null,null,null,null,null,null,null,null,null,null,"vv","vo",null,"vo",null,"vo",null,null,null,"vv",null,null,null,null,null,null,null,"vo"]
["116. AdkomstEjendomsdom",null,null,null,null,null,null,null,null,null,null,null,null,null,null,null,null,null,"ov","vo","ov","vo",null,"vo",null,null,null,"oo",null,null,null,null,null,null,null,"vo"]
{"$rows_left_out":196}
{"sheet":"Vejledning","index":5,"n_rows":20,"n_cols":9,"rows_kept":20,"cut":false,"hidden":true,"merged":[]}
[]
[]
["Aktiver makro"]
["Ark 1","slettes"]
["Ark 1","indsættes fra kontroldigitalsignaturregistret"]
[]
["Version","opdateres med dato/ændring"]
["Brugerark","Opdater "]
["Gem og luk - kontroldigitalsignatur gemmes ikke."]
[]
["Ved ny ekstype skal man yderligere huske flg. når man ændre rollekataloget:"]
[]
["Dataark","Her indsættes ny ekspeditionstype nederst i den bog, hvor den hører til"]
["Dataark 2","Opdateres automatisk, når man går i funtionslinjen og klikker på \"formler\" og under navnestyring markere: ",null,null,null,null,null,null,"BOGEN"]
[null,null,null,null,null,null,null,null,"Klik nederst til højre på en lille rød pil"]
[null,null,null,null,null,null,null,null,"Herefter markeres alle dokumenttyperne i den valgte bog - til og med den nye ekstype"]
[null,null,null,null,null,null,null,null,"klik på ikonet pil ned"]
[null,null,null,null,null,null,null,null,"Luk"]
[null,null,null,null,null,null,null,null,"Gem"]
["Brugerark","Tjek at ny ekstype vises korrekt."]